Target
Tyrosine-protein phosphatase non-receptor type 1
Ligand
BDBM13608
Substrate
BDBM13466
Meas. Tech.
PTP1B Inhibition Assay
pH
7.2±n/a
Temperature
295.15±n/a K
Ki
12000±n/a nM
Citation
 Bleasdale, JEOgg, DPalazuk, BJJacob, CSSwanson, MLWang, XYThompson, DPConradi, RAMathews, WRLaborde, ALStuchly, CWHeijbel, ABergdahl, KBannow, CASmith, CWSvensson, CLiljebris, CSchostarez, HJMay, PDStevens, FCLarsen, SD Small molecule peptidomimetics containing a novel phosphotyrosine bioisostere inhibit protein tyrosine phosphatase 1B and augment insulin action. Biochemistry 40:5642-54 (2001)  
Target
Name:
Tyrosine-protein phosphatase non-receptor type 1
Synonyms:
PTN1_RAT PTPase 1B Ptpn1 | Tyrosine-protein phosphatase, non-receptor type 1
Type:
Enzyme
Mol. Mass.:
49669.91
Organism:
Rattus norvegicus (rat)
Description:
Residue:
432
  
Inhibitor
Name:
BDBM13608
Synonyms:
2-{4-[(2S)-2-(3-formamidopropanoic acid)-2-(pentylcarbamoyl)ethyl]phenoxy}propanedioic acid sulfotyrosyl tripeptide analog 3
Type:
Small organic molecule
Emp. Form.:
C21H28N2O9
Mol. Mass.:
452.455
SMILES:
CCCCCNC(=O)[C@H](Cc1ccc(OC(C(O)=O)C(O)=O)cc1)NC(=O)CCC(O)=O
:
Substrate
Name:
BDBM13466
Synonyms:
4-Nitrophenyl phosphate disodium salt hexahydrate disodium (4-nitrophenyl) phosphate | para-nitrophenyl phosphate (pNPP)
Type:
Small organic molecule
Emp. Form.:
C6H4NO6P
Mol. Mass.:
217.0739
SMILES:
[O-][N+](=O)c1ccc(O[P+]([O-])([O-])[O-])cc1
: