Target
Metabotropic glutamate receptor 5
Ligand
BDBM292268
Substrate
Meas. Tech.
Calcium Influx Assay Based on Fluorescence
EC50
300±n/a nM
Citation
 Park, CEJang, YKShin, YJKim, JYHam, SMKim, YGMin, HKCha, SBJung, HJLee, JYHan, SNChung, JYChoi, EJJoung, CMPark, JSLee, JWCho, NRRyu, EJMaeng, CY Imidazopyrimidine and imidazotriazine derivative, and pharmaceutical composition comprising the same US Patent  US9745310 Publication Date 8/29/2017 
Target
Name:
Metabotropic glutamate receptor 5
Synonyms:
GPRC1E GRM5_HUMAN metabotropic glutamate 5 | metabotropic glutamate 5a
Type:
Enzyme
Mol. Mass.:
132484.72
Organism:
Homo sapiens (Human)
Description:
Residue:
1212
  
Inhibitor
Name:
BDBM292268
Synonyms:
US10100057, Example 123 US9745310, Example 123
Type:
Small organic molecule
Emp. Form.:
C18H12F2N4O
Mol. Mass.:
338.3109
SMILES:
Fc1ccc(cc1)-c1cnc2nc(COc3cc(F)ccn3)cn2c1
: