Target
Fibroblast growth factor receptor 1
Ligand
BDBM337274
Substrate
Meas. Tech.
Enzymatic Assay
IC50
<100±n/a nM
Citation
 Lu, LHe, CYao, W Substituted pyrrolo[2,3-b]pyrazines as FGFR inhibitors US Patent  US9745311 Publication Date 8/29/2017 
Target
Name:
Fibroblast growth factor receptor 1
Synonyms:
BFGFR Basic fibroblast growth factor receptor 1 (FGFR1) CEK FGFR-1 FGFR-1, (FL) FGFR1_HUMAN FLT2 Fibroblast growth factor receptor 1 (FGFR-1) Fms-like tyrosine kinase 2 N-sam bFGF-R | c-fgr
Type:
Receptor
Mol. Mass.:
91861.70
Organism:
Homo sapiens (Human)
Description:
P11362
Residue:
822
  
Inhibitor
Name:
BDBM337274
Synonyms:
2-[2-(3,5-dimethoxyphenyl)ethyl]-6-(2-methylphenyl)-5H-pyrrolo[2,3-b]pyrazine | US9745311, Example 9
Type:
Small organic molecule
Emp. Form.:
C23H23N3O2
Mol. Mass.:
373.4476
SMILES:
COc1cc(CCc2cnc3[nH]c(cc3n2)-c2ccccc2C)cc(OC)c1
: