Target
Fibroblast growth factor receptor 1
Ligand
BDBM337313
Substrate
Meas. Tech.
Enzymatic Assay
IC50
<100±n/a nM
Citation
 Lu, LHe, CYao, W Substituted pyrrolo[2,3-b]pyrazines as FGFR inhibitors US Patent  US9745311 Publication Date 8/29/2017 
Target
Name:
Fibroblast growth factor receptor 1
Synonyms:
BFGFR Basic fibroblast growth factor receptor 1 (FGFR1) CEK FGFR-1 FGFR-1, (FL) FGFR1_HUMAN FLT2 Fibroblast growth factor receptor 1 (FGFR-1) Fms-like tyrosine kinase 2 N-sam bFGF-R | c-fgr
Type:
Receptor
Mol. Mass.:
91861.70
Organism:
Homo sapiens (Human)
Description:
P11362
Residue:
822
  
Inhibitor
Name:
BDBM337313
Synonyms:
1-[2-(4-{2-[2-(3,5-dimethoxyphenyl)ethyl]-5H-pyrrolo[2,3-b]pyrazin-6-yl}-1H-pyrazol-1-yl)ethyl]piperidin-4-ol | US9745311, Example 40
Type:
Small organic molecule
Emp. Form.:
C26H32N6O3
Mol. Mass.:
476.5707
SMILES:
COc1cc(CCc2cnc3[nH]c(cc3n2)-c2cnn(CCN3CCC(O)CC3)c2)cc(OC)c1
: