Target
Fibroblast growth factor receptor 2
Ligand
BDBM337348
Substrate
Meas. Tech.
Enzymatic Assay
IC50
<100±n/a nM
Citation
 Lu, LHe, CYao, W Substituted pyrrolo[2,3-b]pyrazines as FGFR inhibitors US Patent  US9745311 Publication Date 8/29/2017 
Target
Name:
Fibroblast growth factor receptor 2
Synonyms:
BEK FGFR-2 FGFR2 Fibroblast growth factor receptor 2 (FGFR2) KGFR Keratinocyte growth factor receptor VEGF-receptor 2 and Fibroblast growth factor receptor 2
Type:
Enzyme
Mol. Mass.:
92015.45
Organism:
Homo sapiens (Human)
Description:
P21802
Residue:
821
  
Inhibitor
Name:
BDBM337348
Synonyms:
(4-(2-(3,5-Dimethoxyphenethyl)-5H-pyrrolo[2,3-b]pyrazin-6-yl)pyridin-2-yl)(3-hydroxyazetidin-1-yl)methanone | US9745311, Example 75
Type:
Small organic molecule
Emp. Form.:
C25H25N5O4
Mol. Mass.:
459.4971
SMILES:
COc1cc(CCc2cnc3[nH]c(cc3n2)-c2ccnc(c2)C(=O)N2CC(O)C2)cc(OC)c1
: