Target
Fibroblast growth factor receptor 1
Ligand
BDBM337351
Substrate
Meas. Tech.
Enzymatic Assay
IC50
<100±n/a nM
Citation
 Lu, LHe, CYao, W Substituted pyrrolo[2,3-b]pyrazines as FGFR inhibitors US Patent  US9745311 Publication Date 8/29/2017 
Target
Name:
Fibroblast growth factor receptor 1
Synonyms:
BFGFR Basic fibroblast growth factor receptor 1 (FGFR1) CEK FGFR-1 FGFR-1, (FL) FGFR1_HUMAN FLT2 Fibroblast growth factor receptor 1 (FGFR-1) Fms-like tyrosine kinase 2 N-sam bFGF-R | c-fgr
Type:
Receptor
Mol. Mass.:
91861.70
Organism:
Homo sapiens (Human)
Description:
P11362
Residue:
822
  
Inhibitor
Name:
BDBM337351
Synonyms:
2-(3,5-Dimethoxyphenethyl)-6-(3-(piperazin-1-yl)phenyl)-5H-pyrrolo[2,3-b]pyrazine | US9745311, Example 78
Type:
Small organic molecule
Emp. Form.:
C26H29N5O2
Mol. Mass.:
443.5408
SMILES:
COc1cc(CCc2cnc3[nH]c(cc3n2)-c2cccc(c2)N2CCNCC2)cc(OC)c1
: