Target
D(1A) dopamine receptor
Ligand
BDBM337383
Substrate
Meas. Tech.
Binding Assay
Ki
82.5±n/a nM
Citation
 Gray, DLZhang, LBrodney, MADavoren, JEEfremov, IVGreen, MEO Neil, SVRogers, BN Heterocyclic compounds and their use as dopamine D1 ligands US Patent  US9745317 Publication Date 8/29/2017 
Target
Name:
D(1A) dopamine receptor
Synonyms:
DA D1 receptor DRD1 Dopamine D1 receptor Dopamine D1A
Type:
Enzyme
Mol. Mass.:
49303.43
Organism:
Homo sapiens (Human)
Description:
P21728
Residue:
446
  
Inhibitor
Name:
BDBM337383
Synonyms:
US9745317, 21 US9745317, 23
Type:
Small organic molecule
Emp. Form.:
C20H19N3O3
Mol. Mass.:
349.3832
SMILES:
Cc1cc(Oc2nccc3OCCc23)ccc1-c1c(C)ncc(=O)n1C
: