Target
D(1A) dopamine receptor
Ligand
BDBM337389
Substrate
Meas. Tech.
Binding Assay
Ki
44.4±n/a nM
Citation
 Gray, DLZhang, LBrodney, MADavoren, JEEfremov, IVGreen, MEO Neil, SVRogers, BN Heterocyclic compounds and their use as dopamine D1 ligands US Patent  US9745317 Publication Date 8/29/2017 
Target
Name:
D(1A) dopamine receptor
Synonyms:
DA D1 receptor DRD1 Dopamine D1 receptor Dopamine D1A
Type:
Enzyme
Mol. Mass.:
49303.43
Organism:
Homo sapiens (Human)
Description:
P21728
Residue:
446
  
Inhibitor
Name:
BDBM337389
Synonyms:
US9745317, 27
Type:
Small organic molecule
Emp. Form.:
C18H17N5O3
Mol. Mass.:
351.3593
SMILES:
Cc1c(-c2ccc(Oc3ncnc4NCCc34)cc2)n(C)c(=O)[nH]c1=O
: