Target
Phosphatidylinositol 4,5-bisphosphate 3-kinase catalytic subunit delta isoform
Ligand
BDBM337521
Substrate
Meas. Tech.
Enzyme Activity Inhibition Assay
IC50
32.0±n/a nM
Citation
 Xu, Z Fused pyrimidine compound, intermediate, preparation method therefor, and composition and application thereof US Patent  US9745321 Publication Date 8/29/2017 
Target
Name:
Phosphatidylinositol 4,5-bisphosphate 3-kinase catalytic subunit delta isoform
Synonyms:
PI3-kinase p110 subunit delta PI3-kinase subunit p110-delta PIK3CD Phosphatidylinositol 4,5-biphosphate 3-kinase catalytic subunit delta (PIK3CD) Phosphatidylinositol 4,5-bisphosphate 3-kinase 110 kDa catalytic subunit delta (PI3K delta) Phosphatidylinositol 4,5-bisphosphate 3-kinase catalytic subunit delta (PI3Kdelta) Phosphatidylinositol 4,5-bisphosphate 3-kinase catalytic subunit delta isoform (PI3K delta) Phosphatidylinositol 4,5-bisphosphate 3-kinase catalytic subunit delta isoform (PI3K-delta) Phosphatidylinositol 4,5-bisphosphate 3-kinase catalytic subunit delta isoform (PI3Kdelta)
Type:
Enzyme Subunit
Mol. Mass.:
119489.41
Organism:
Homo sapiens (Human)
Description:
O00329
Residue:
1044
  
Inhibitor
Name:
BDBM337521
Synonyms:
US9745321, Compound 143
Type:
Small organic molecule
Emp. Form.:
C26H30N6O4S3
Mol. Mass.:
586.749
SMILES:
COc1ncc(cc1NS(C)(=O)=O)-c1nc(nc2c(CN3CCc4sccc4C3)c(C)sc12)N1CCOCC1
: