Target
Beta-secretase 1
Ligand
BDBM337535
Substrate
Meas. Tech.
HTRF FRET Assay
Ki
32.0±n/a nM
Citation
 Dai, XCumming, JNScott, JDLiu, HPalani, A Iminothiadiazepane dioxide compounds as BACE inhibitors, compositions, and their use US Patent  US9745324 Publication Date 8/29/2017 
Target
Name:
Beta-secretase 1
Synonyms:
ASP2 Aspartyl protease 2 BACE1 Beta-secretase (BACE) Beta-secretase 1 (BACE 1) Beta-secretase 1 (BACE1) Beta-site amyloid precursor protein cleaving enzyme 1 Memapsin-2 beta-Secretase (BACE-1) | beta-Secretase (BACE1)
Type:
Protein
Mol. Mass.:
55755.10
Organism:
Homo sapiens (Human)
Description:
P56817
Residue:
501
  
Inhibitor
Name:
BDBM337535
Synonyms:
US9745324, 4
Type:
Small organic molecule
Emp. Form.:
C21H24F3N5O4S
Mol. Mass.:
499.507
SMILES:
CN1C[C@](C)(NC(=N)C(C)(C)S1(=O)=O)c1cc(NC(=O)c2ccc(OC(F)F)cn2)ccc1F
: