Target
Dipeptidyl peptidase 1
Ligand
BDBM201549
Substrate
Meas. Tech.
Inhibition of Human DPPI (Cathepsin C)
Temperature
298.15±n/a K
IC50
2.00±0 nM
Comments
extracted
Citation
 Vintonyak, VGrauert, MGrundl, MPautsch, A Substituted spirocycles US Patent  US9540373 Publication Date 1/10/2017 
Target
Name:
Dipeptidyl peptidase 1
Synonyms:
CATC_HUMAN CTSC Cathepsin J Dipeptidyl peptidase 1 (DPPI) Dipeptidyl peptidase I (DPPI)
Type:
Enzyme
Mol. Mass.:
51857.28
Organism:
Homo sapiens (Human)
Description:
P53634
Residue:
463
  
Inhibitor
Name:
BDBM201549
Synonyms:
US9540373, 26 USRE47636, Example 26
Type:
Small organic molecule
Emp. Form.:
C28H32FN5O2
Mol. Mass.:
489.5844
SMILES:
CN1CCC2(CC1)OCc1cnc(cc21)-c1ccc(C[C@H](NC(=O)[C@H]2N[C@@H]3CC[C@H]2C3)C#N)c(F)c1
: