Target
Dipeptidyl peptidase 1
Ligand
BDBM201550
Substrate
Meas. Tech.
Inhibition of Human DPPI (Cathepsin C)
Temperature
298.15±n/a K
IC50
2.90±0 nM
Comments
extracted
Citation
 Vintonyak, VGrauert, MGrundl, MPautsch, A Substituted spirocycles US Patent  US9540373 Publication Date 1/10/2017 
Target
Name:
Dipeptidyl peptidase 1
Synonyms:
CATC_HUMAN CTSC Cathepsin J Dipeptidyl peptidase 1 (DPPI) Dipeptidyl peptidase I (DPPI)
Type:
Enzyme
Mol. Mass.:
51857.28
Organism:
Homo sapiens (Human)
Description:
P53634
Residue:
463
  
Inhibitor
Name:
BDBM201550
Synonyms:
US9540373, 27 USRE47636, Example 27
Type:
Small organic molecule
Emp. Form.:
C32H37FN4O3
Mol. Mass.:
544.6596
SMILES:
Fc1cc(ccc1C[C@H](NC(=O)C12CCC(CC1)CN2)C#N)-c1ccc2COC3(CCN(CC3)C3COC3)c2c1
: