Target
Flap endonuclease 1
Ligand
BDBM283229
Substrate
Meas. Tech.
Binding Assay
Ki
<1±n/a nM
Comments
Zero 01/04/2022
Citation
 Bacani, GMEccles, WFitzgerald, AEGoldberg, SDHack, MDHawryluk, NAJones, WMKeith, JMKrawczuk, PLebsack, ADLee-Dutra, ALiu, JMcClure, KJMeduna, SPPippel, DJRosen, MDSales, ZS Flap modulators US Patent  US9745328 Publication Date 8/29/2017 
Target
Name:
Flap endonuclease 1
Synonyms:
DNase IV FEN1 Flap structure-specific endonuclease 1 Maturation factor 1 hFEN-1
Type:
PROTEIN
Mol. Mass.:
42602.57
Organism:
Homo sapiens (Human)
Description:
ChEMBL_1517026
Residue:
380
  
Inhibitor
Name:
BDBM283229
Synonyms:
4'-(5-Aminopyrazin-2-yl)-3'-fluoro-N-(3- hydroxy-1,1-dimethylpropyl)biphenyl-2- sulfonamide US9884878, Compound 102
Type:
Small organic molecule
Emp. Form.:
C21H23FN4O3S
Mol. Mass.:
430.496
SMILES:
CC(C)(CCO)NS(=O)(=O)c1ccccc1-c1ccc(c(F)c1)-c1cnc(N)cn1
: