Target
Flap endonuclease 1
Ligand
BDBM168914
Substrate
Meas. Tech.
Binding Assay
Ki
1.000±n/a nM
Citation
 Bacani, GMEccles, WFitzgerald, AEGoldberg, SDHack, MDHawryluk, NAJones, WMKeith, JMKrawczuk, PLebsack, ADLee-Dutra, ALiu, JMcClure, KJMeduna, SPPippel, DJRosen, MDSales, ZS Flap modulators US Patent  US9745328 Publication Date 8/29/2017 
Target
Name:
Flap endonuclease 1
Synonyms:
DNase IV FEN1 Flap structure-specific endonuclease 1 Maturation factor 1 hFEN-1
Type:
PROTEIN
Mol. Mass.:
42602.57
Organism:
Homo sapiens (Human)
Description:
ChEMBL_1517026
Residue:
380
  
Inhibitor
Name:
BDBM168914
Synonyms:
US9079866, 315 US9884878, Compound 315
Type:
Small organic molecule
Emp. Form.:
C20H16F4N4O3S
Mol. Mass.:
468.425
SMILES:
Nc1ncc(cn1)-c1ccc(cc1F)-c1ccccc1S(=O)(=O)N1CC(O)(C1)C(F)(F)F
: