Target
Flap endonuclease 1
Ligand
BDBM337603
Substrate
Meas. Tech.
Binding Assay
Ki
0.700±n/a nM
Citation
 Bacani, GMEccles, WFitzgerald, AEGoldberg, SDHack, MDHawryluk, NAJones, WMKeith, JMKrawczuk, PLebsack, ADLee-Dutra, ALiu, JMcClure, KJMeduna, SPPippel, DJRosen, MDSales, ZS Flap modulators US Patent  US9745328 Publication Date 8/29/2017 
Target
Name:
Flap endonuclease 1
Synonyms:
DNase IV FEN1 Flap structure-specific endonuclease 1 Maturation factor 1 hFEN-1
Type:
PROTEIN
Mol. Mass.:
42602.57
Organism:
Homo sapiens (Human)
Description:
ChEMBL_1517026
Residue:
380
  
Inhibitor
Name:
BDBM337603
Synonyms:
4-{[4'-(5-Aminopyrazin-2-yl)-3'- fluorobiphenyl-2-yl]oxy}benzoic acid | US9745328, Compound 888
Type:
Small organic molecule
Emp. Form.:
C23H16FN3O3
Mol. Mass.:
401.3898
SMILES:
Nc1cnc(cn1)-c1ccc(cc1F)-c1ccccc1Oc1ccc(cc1)C(O)=O
: