Target
11-beta-hydroxysteroid dehydrogenase type 2
Ligand
BDBM13770
Substrate
BDBM13775
Meas. Tech.
Human and Mouse 11beta-HSD1 SPA Assay
IC50
25000±n/a nM
Citation
 Patel, JRShuai, QDinges, JWinn, MPliushchev, MFung, SMonzon, KChiou, WWang, JPan, LWagaw, SEngstrom, KKerdesky, FALongenecker, KJudge, RQin, WImade, HMStolarik, DBeno, DWBrune, MChovan, LESham, HLJacobson, PLink, JT Discovery of adamantane ethers as inhibitors of 11beta-HSD-1: Synthesis and biological evaluation. Bioorg Med Chem Lett 17:750-5 (2007)  
Target
Name:
11-beta-hydroxysteroid dehydrogenase type 2
Synonyms:
11-DH2 11-beta-Hydroxysteroid Dehydrogenase 2 (11-beta-HSD2) 11-beta-hydroxysteroid dehydrogenase 2 11-beta-hydroxysteroid dehydrogenase type 2 (11-beta-HSD2) DHI2_HUMAN HSD11K SDR9C3
Type:
Enzyme
Mol. Mass.:
44141.72
Organism:
Homo sapiens (Human)
Description:
Purified recombinant human 11beta-HSD2.
Residue:
405
  
Inhibitor
Name:
BDBM13770
Synonyms:
2-(4-chlorophenoxy)-N-[(1R,2S,5R,7S)-5-(hydroxymethyl)adamantan-2-yl]-2-methylpropanamide | adamantane ether 24
Type:
Small organic molecule
Emp. Form.:
C21H28ClNO3
Mol. Mass.:
377.905
SMILES:
CC(C)(Oc1ccc(Cl)cc1)C(=O)N[C@H]1C2C[C@@H]3C[C@@H]1C[C@](CO)(C3)C2
:
Substrate
Name:
BDBM13775
Synonyms:
(1S,2R,10S,11S,14R,15S,17S)-14,17-dihydroxy-14-(2-hydroxyacetyl)-2,15-dimethyltetracyclo[8.7.0.0^{2,7}.0^{11,15}]heptadec-6-en-5-one 3H-cortisol US10188667, Example 00023 cortisol
Type:
Steroid
Emp. Form.:
C21H30O5
Mol. Mass.:
362.4599
SMILES:
[H][C@@]12CC[C@](O)(C(=O)CO)[C@@]1(C)C[C@H](O)[C@@]1([H])[C@@]2([H])CCC2=CC(=O)CC[C@]12C
: