Target
High affinity nerve growth factor receptor
Ligand
BDBM266501
Substrate
Meas. Tech.
Binding Assay
IC50
55±n/a nM
Citation
 Andrews, SWCondroski, KRHaas, JJiang, YKolakowski, GRSeo, JYang, HZhao, Q Macrocyclic compounds as Trk kinase inhibitors US Patent  US9750744 Publication Date 9/5/2017 
Target
Name:
High affinity nerve growth factor receptor
Synonyms:
2.7.10.1 NTRK1 NTRK1_HUMAN Neurotrophic tyrosine kinase receptor type 1 Synonyms=MTC TRK1-transforming tyrosine kinase protein TRKA GN Tropomyosin alpha-3 chain/High affinity nerve growth factor receptor Tropomyosin-related kinase A (TrkA) Tyrosine kinase receptor (Trk) Tyrosine kinase receptor A (Trk A) Tyrosine kinase receptor A (TrkA) p140-TrkA
Type:
Mol. Mass.:
87498.18
Organism:
Homo sapiens (Human)
Description:
P04629
Residue:
796
  
Inhibitor
Name:
BDBM266501
Synonyms:
US10688100, Compound 2 US9718822, 2 US9902741, Example 2
Type:
Small organic molecule
Emp. Form.:
C19H20N6O2
Mol. Mass.:
364.4011
SMILES:
O=C1NCCCOc2cccc(n2)[C@H]2CCCN2c2ccn3ncc1c3n2
: