Target
High affinity nerve growth factor receptor
Ligand
BDBM267411
Substrate
Meas. Tech.
ELISA Assay
IC50
55±n/a nM
Citation
 Andrews, SWCondroski, KRHaas, JJiang, YKolakowski, GRSeo, JYang, HZhao, Q Macrocyclic compounds as Trk kinase inhibitors US Patent  US9750744 Publication Date 9/5/2017 
Target
Name:
High affinity nerve growth factor receptor
Synonyms:
2.7.10.1 NTRK1 NTRK1_HUMAN Neurotrophic tyrosine kinase receptor type 1 Synonyms=MTC TRK1-transforming tyrosine kinase protein TRKA GN Tropomyosin alpha-3 chain/High affinity nerve growth factor receptor Tropomyosin-related kinase A (TrkA) Tyrosine kinase receptor (Trk) Tyrosine kinase receptor A (Trk A) Tyrosine kinase receptor A (TrkA) p140-TrkA
Type:
Mol. Mass.:
87498.18
Organism:
Homo sapiens (Human)
Description:
P04629
Residue:
796
  
Inhibitor
Name:
BDBM267411
Synonyms:
US9718822, 5 US9902741, Example 5
Type:
Small organic molecule
Emp. Form.:
C19H19FN6O3
Mol. Mass.:
398.391
SMILES:
O[C@H]1CNC(=O)c2cnn3ccc(nc23)N2CCC[C@@H]2c2cc(F)cn(C1)c2=O
: