Target
High affinity nerve growth factor receptor
Ligand
BDBM267416
Substrate
Meas. Tech.
Binding Assay
IC50
55±n/a nM
Citation
 Andrews, SWCondroski, KRHaas, JJiang, YKolakowski, GRSeo, JYang, HZhao, Q Macrocyclic compounds as Trk kinase inhibitors US Patent  US9750744 Publication Date 9/5/2017 
Target
Name:
High affinity nerve growth factor receptor
Synonyms:
2.7.10.1 NTRK1 NTRK1_HUMAN Neurotrophic tyrosine kinase receptor type 1 Synonyms=MTC TRK1-transforming tyrosine kinase protein TRKA GN Trk-A Tropomyosin-related kinase A Tyrosine kinase receptor Tyrosine kinase receptor A Tyrosine kinase receptor A (Trk-A) gp140trk | p140-TrkA
Type:
Mol. Mass.:
87498.18
Organism:
Homo sapiens (Human)
Description:
P04629
Residue:
796
  
Inhibitor
Name:
BDBM267416
Synonyms:
US10688100, Compound 9 US9718822, 10 US9750744, Example 10 | US9902741, Example 10
Type:
Small organic molecule
Emp. Form.:
C18H17FN6O2
Mol. Mass.:
368.365
SMILES:
Fc1cnc2OCCNC(=O)c3cnn4ccc(nc34)N3CCC[C@@H]3c2c1
: