Target
Histone deacetylase 1
Ligand
BDBM50398719
Substrate
Meas. Tech.
Inhibition Assay
IC50
8120±600 nM
Citation
 Sotomayor, EMBergman, JAKozikowski, APVillagra, AVWoan, KV Selective histone deactylase 6 inhibitors US Patent  US9751832 Publication Date 9/5/2017 
Target
Name:
Histone deacetylase 1
Synonyms:
Cereblon/Histone deacetylase 1 HDAC1 Histone deacetylase 1 (HDAC1) RPD3L1
Type:
Enzyme
Mol. Mass.:
55090.27
Organism:
Homo sapiens (Human)
Description:
Q13547
Residue:
482
  
Inhibitor
Name:
BDBM50398719
Synonyms:
CHEMBL2179244 US9409858, 8a US9956192, Compound 8a
Type:
Small organic molecule
Emp. Form.:
C19H23N3O3
Mol. Mass.:
341.4042
SMILES:
CCCCN(C(=O)NCc1ccc(cc1)C(=O)NO)c1ccccc1
: