Target
Dipeptidyl peptidase 8
Ligand
BDBM13792
Substrate
BDBM11057
Meas. Tech.
DPP Inhibition Assay
pH
7.5±n/a
Temperature
295.15±n/a K
Ki
>3000±n/a nM
Citation
 Kurukulasuriya, RRohde, JJSzczepankiewicz, BGBasha, FLai, CJae, HSWinn, MStewart, KDLongenecker, KLLubben, TWBallaron, SJSham, HLvon Geldern, TW Xanthine mimetics as potent dipeptidyl peptidase IV inhibitors. Bioorg Med Chem Lett 16:6226-30 (2006)  
Target
Name:
Dipeptidyl peptidase 8
Synonyms:
DPP8 DPRP-1 Dipeptidyl peptidase 8 (DPP-8) Dipeptidyl peptidase 8/9 Dipeptidyl peptidase VIII Prolyl dipeptidase DPP8
Type:
Enzyme
Mol. Mass.:
103342.62
Organism:
Homo sapiens (Human)
Description:
Q6V1X1
Residue:
898
  
Inhibitor
Name:
BDBM13792
Synonyms:
2-{[2-(3-aminopiperidin-1-yl)-5-methyl-4,6-dioxo-1H,4H,5H,6H-pyrrolo[3,4-d]imidazol-1-yl]methyl}benzonitrile | Xanthine mimetic compound 7
Type:
Small organic molecule
Emp. Form.:
C19H20N6O2
Mol. Mass.:
364.4011
SMILES:
CN1C(=O)c2nc(N3CCCC(N)C3)n(Cc3ccccc3C#N)c2C1=O
:
Substrate
Name:
BDBM11057
Synonyms:
1-(2-aminoacetyl)-N-(4-methyl-2-oxo-2H-chromen-7-yl)pyrrolidine-2-carboxamide hydrobromide Gly-Pro-7-amidomethylcoumarin | Gly-Pro-AMC
Type:
Small organic molecule
Emp. Form.:
C17H19N3O4
Mol. Mass.:
329.3505
SMILES:
Cc1cc(=O)oc2cc(NC(=O)C3CCCN3C(=O)CN)ccc12
: