Target
Tyrosine-protein phosphatase non-receptor type 1 [1-298]
Ligand
BDBM13809
Substrate
BDBM13466
Meas. Tech.
Phosphatase Inhibition Assay
pH
7±n/a
Temperature
295.15±n/a K
IC50
65±n/a nM
Citation
 Ala, PJGonneville, LHillman, MCBecker-Pasha, MWei, MReid, BGKlabe, RYue, EWWayland, BDouty, BPolam, PWasserman, ZBower, MCombs, APBurn, TCHollis, GFWynn, R Structural basis for inhibition of protein-tyrosine phosphatase 1B by isothiazolidinone heterocyclic phosphonate mimetics. J Biol Chem 281:32784-95 (2006)  
Target
Name:
Tyrosine-protein phosphatase non-receptor type 1 [1-298]
Synonyms:
PTN1_HUMAN PTP1B PTPase 1B Tyrosine-protein phosphatase, non-receptor type 1
Type:
Enzyme
Mol. Mass.:
34670.65
Organism:
Homo sapiens (Human)
Description:
The catalytic domain of PTP 1B (residues 1-298) was expressed and purified from E. coli.
Residue:
298
  
Inhibitor
Name:
BDBM13809
Synonyms:
(2S)-N-[(1S)-1-carbamoyl-2-[4-(1,1,3-trioxo-2,3-dihydro-1,2-thiazol-5-yl)phenyl]ethyl]-3-phenyl-2-{1-[4-(1,1,3-trioxo-2,3-dihydro-1,2-thiazol-5-yl)phenyl]acetamido}propanamide | IZD 4
Type:
Small organic molecule
Emp. Form.:
C32H29N5O9S2
Mol. Mass.:
691.731
SMILES:
NC(=O)[C@H](Cc1ccc(cc1)C1=CC(=O)NS1(=O)=O)NC(=O)[C@H](Cc1ccccc1)NC(=O)Cc1ccc(cc1)C1=CC(=O)NS1(=O)=O
:
Substrate
Name:
BDBM13466
Synonyms:
4-Nitrophenyl phosphate disodium salt hexahydrate disodium (4-nitrophenyl) phosphate | para-nitrophenyl phosphate (pNPP)
Type:
Small organic molecule
Emp. Form.:
C6H4NO6P
Mol. Mass.:
217.0739
SMILES:
[O-][N+](=O)c1ccc(O[P+]([O-])([O-])[O-])cc1
: