Target
cAMP and cAMP-inhibited cGMP 3',5'-cyclic phosphodiesterase 10A
Ligand
BDBM201611
Substrate
Meas. Tech.
Scintillation Proximity Assay (SPA)
Temperature
298.15±n/a K
IC50
1680±0 nM
Comments
extracted
Citation
 Flohr, AZbinden, KGKoerner, MLerner, C Pyrrolidino heterocycles US Patent  US9540384 Publication Date 1/10/2017 
Target
Name:
cAMP and cAMP-inhibited cGMP 3',5'-cyclic phosphodiesterase 10A
Synonyms:
3',5'-cyclic phosphodiesterase PDE10A Phosphodiesterase 10 (PDE10) | Phosphodiesterase 10A
Type:
Protein
Mol. Mass.:
88412.52
Organism:
Homo sapiens (Human)
Description:
Q9Y233
Residue:
1055
  
Inhibitor
Name:
BDBM201611
Synonyms:
2-methyl-3-((6-(piperidin-1-yl)pyridin-2-yl)methoxy)quinoxaline US9540384, 15
Type:
Small organic molecule
Emp. Form.:
C20H22N4O
Mol. Mass.:
334.4149
SMILES:
Cc1nc2ccccc2nc1OCc1cccc(n1)N1CCCCC1
: