Target
cAMP and cAMP-inhibited cGMP 3',5'-cyclic phosphodiesterase 10A
Ligand
BDBM201613
Substrate
Meas. Tech.
Scintillation Proximity Assay (SPA)
Temperature
298.15±n/a K
IC50
7.00±0 nM
Comments
extracted
Citation
 Flohr, AZbinden, KGKoerner, MLerner, C Pyrrolidino heterocycles US Patent  US9540384 Publication Date 1/10/2017 
Target
Name:
cAMP and cAMP-inhibited cGMP 3',5'-cyclic phosphodiesterase 10A
Synonyms:
3',5'-cyclic phosphodiesterase PDE10_HUMAN Phosphodiesterase 10A
Type:
Protein
Mol. Mass.:
88412.52
Organism:
Homo sapiens (Human)
Description:
Q9Y233
Residue:
779
  
Inhibitor
Name:
BDBM201613
Synonyms:
6-chloro-n,n-dimethyl-2-((6-(pyrrolidin-1-yl)pyridin-2-yl)methoxy)quinazolin-4-amine US9540384, 17
Type:
Small organic molecule
Emp. Form.:
C20H22ClN5O
Mol. Mass.:
383.875
SMILES:
CN(C)c1nc(OCc2cccc(n2)N2CCCC2)nc2ccc(Cl)cc12
: