Target
cAMP and cAMP-inhibited cGMP 3',5'-cyclic phosphodiesterase 10A
Ligand
BDBM202032
Substrate
Meas. Tech.
Scintillation Proximity Assay (SPA)
Temperature
298.15±n/a K
IC50
100.0±0 nM
Comments
extracted
Citation
 Flohr, AZbinden, KGKoerner, MLerner, C Pyrrolidino heterocycles US Patent  US9540384 Publication Date 1/10/2017 
Target
Name:
cAMP and cAMP-inhibited cGMP 3',5'-cyclic phosphodiesterase 10A
Synonyms:
3',5'-cyclic phosphodiesterase PDE10_HUMAN Phosphodiesterase 10A
Type:
Protein
Mol. Mass.:
88412.52
Organism:
Homo sapiens (Human)
Description:
Q9Y233
Residue:
779
  
Inhibitor
Name:
BDBM202032
Synonyms:
6-chloro-2-(2-(6-(pyrrolidin-1-yl)pyridin-2-yl)ethyl)quinazolin-4(3h)-one | US9540384, 29
Type:
Small organic molecule
Emp. Form.:
C19H19ClN4O
Mol. Mass.:
354.833
SMILES:
Clc1ccc2nc(CCc3cccc(n3)N3CCCC3)[nH]c(=O)c2c1
: