Target
cAMP and cAMP-inhibited cGMP 3',5'-cyclic phosphodiesterase 10A
Ligand
BDBM202284
Substrate
Meas. Tech.
Scintillation Proximity Assay (SPA)
Temperature
298.15±n/a K
IC50
600±0 nM
Comments
extracted
Citation
 Flohr, AZbinden, KGKoerner, MLerner, C Pyrrolidino heterocycles US Patent  US9540384 Publication Date 1/10/2017 
Target
Name:
cAMP and cAMP-inhibited cGMP 3',5'-cyclic phosphodiesterase 10A
Synonyms:
3',5'-cyclic phosphodiesterase PDE10A Phosphodiesterase 10 (PDE10) | Phosphodiesterase 10A
Type:
Protein
Mol. Mass.:
88412.52
Organism:
Homo sapiens (Human)
Description:
Q9Y233
Residue:
1055
  
Inhibitor
Name:
BDBM202284
Synonyms:
2-cyclopropyl-6-((6-(pyrrolidin-1-yl)pyridin-2-yl)methoxy)imidazo[1,2-b]pyridazine | US9540384, 55
Type:
Small organic molecule
Emp. Form.:
C19H21N5O
Mol. Mass.:
335.4029
SMILES:
C(Oc1ccc2nc(cn2n1)C1CC1)c1cccc(n1)N1CCCC1
: