Target
Coagulation factor X
Ligand
BDBM13820
Substrate
BDBM12500
Meas. Tech.
Factor Xa Inhibition Assay
pH
7.8±n/a
Temperature
298.15±n/a K
Ki
13±n/a nM
Citation
 Matter, HDefossa, EHeinelt, UBlohm, PMSchneider, DMuller, AHerok, SSchreuder, HLiesum, ABrachvogel, VLonze, PWalser, AAl-Obeidi, FWildgoose, P Design and quantitative structure-activity relationship of 3-amidinobenzyl-1H-indole-2-carboxamides as potent, nonchiral, and selective inhibitors of blood coagulation factor Xa. J Med Chem 45:2749-69 (2002)  
Target
Name:
Coagulation factor X
Synonyms:
Activated coagulation factor X (FXa) Coagulation factor X precursor F10 Factor X heavy chain Factor Xa Stuart-Prower factor
Type:
Enzyme
Mol. Mass.:
54726.60
Organism:
Homo sapiens (Human)
Description:
Residue:
488
  
Inhibitor
Name:
BDBM13820
Synonyms:
3-amidinobenzylindole carboxamide 4 | 3-bromo-1-[(3-carbamimidoylphenyl)methyl]-N-[(3,5-dimethylphenyl)methyl]-1H-indole-2-carboxamide
Type:
Small organic molecule
Emp. Form.:
C26H25BrN4O
Mol. Mass.:
489.407
SMILES:
Cc1cc(C)cc(CNC(=O)c2c(Br)c3ccccc3n2Cc2cccc(c2)C(N)=N)c1
:
Substrate
Name:
BDBM12500
Synonyms:
Cbz-D-Arg-Gly-L-Arg-pNA N-a-Benzyloxycarbonyl-Darginyl-L-glycyl-L-arginine-pnitroaniline benzyl N-[(1R)-4-carbamimidamido-1-[({[(1S)-4-carbamimidamido-1-[(4-nitrophenyl)carbamoyl]butyl]carbamoyl}methyl)carbamoyl]butyl]carbamate
Type:
Small organic molecule
Emp. Form.:
C28H39N11O7
Mol. Mass.:
641.6788
SMILES:
[#7]\[#6](-[#7])=[#7]/[#6]-[#6]-[#6]-[#6@@H](-[#7]-[#6](=O)-[#8]-[#6]-c1ccccc1)-[#6](=O)-[#7]-[#6]-[#6](=O)-[#7]-[#6@@H](-[#6]-[#6]-[#6]-[#7+]=[#6](-[#7])-[#7-])-[#6](=O)-[#7]-c1ccc(cc1)-[#7+](-[#8-])=O
: