Target
Tyrosine-protein kinase SYK
Ligand
BDBM298428
Substrate
Meas. Tech.
GSK 3α Enzyme Inhibition
IC50
57.0±n/a nM
Citation
 Baker, TMFyfe, MCJones, GThom, SM Kinase inhibitors US Patent  US9751837 Publication Date 9/5/2017 
Target
Name:
Tyrosine-protein kinase SYK
Synonyms:
KSYK_HUMAN Spleen Tyrosine Kinase Tyrosine-protein kinase SYK (Syk)
Type:
Enzyme
Mol. Mass.:
72079.99
Organism:
Homo sapiens (Human)
Description:
P43405
Residue:
635
  
Inhibitor
Name:
BDBM298428
Synonyms:
4-[[4-[[4-[[5-tert-butyl-3-(methanesulfonamido)-2-methoxy-phenyl]carbamoylamino]-1-naphthyl]oxy]-2-pyridyl]amino]-N-[3-(1,1-dioxo-1,4-thiazinan-4-yl)propyl]-2-methoxy-benzamide US10941115, Example 17(ah) | US9751837, Example 17(ah)
Type:
Small organic molecule
Emp. Form.:
C43H51N7O9S2
Mol. Mass.:
874.037
SMILES:
COc1cc(Nc2cc(Oc3ccc(NC(=O)Nc4cc(cc(NS(C)(=O)=O)c4OC)C(C)(C)C)c4ccccc34)ccn2)ccc1C(=O)NCCCN1CCS(=O)(=O)CC1
: