Target
Chymase
Ligand
BDBM337656
Substrate
Meas. Tech.
Enzymatic Assay
IC50
189±n/a nM
Citation
 Fürstner, CAckerstaff, JStraub, AMeier, HTinel, HZimmermann, KTersteegen, AZubov, DKast, RSchamberger, JSchäfer, M Substituted uracils and use thereof US Patent  US9751843 Publication Date 9/5/2017 
Target
Name:
Chymase
Synonyms:
Alpha-chymase CMA1_HUMAN CYM Mast cell protease I
Type:
Enzyme
Mol. Mass.:
27340.12
Organism:
Homo sapiens (Human)
Description:
Residue:
247
  
Inhibitor
Name:
BDBM337656
Synonyms:
Ethyl 3-[2-methyl-3-(trifluoromethyl)benzyl]-2,4-dioxo-1-[4-(3-oxomorpholin-4-yl)phenyl]-1,2,3,4-tetrahydropyrimidine-5-carboxylate | US9751843, 22
Type:
Small organic molecule
Emp. Form.:
C26H24F3N3O6
Mol. Mass.:
531.4805
SMILES:
CCOC(=O)c1cn(-c2ccc(cc2)N2CCOCC2=O)c(=O)n(Cc2cccc(c2C)C(F)(F)F)c1=O
: