Target
Chymase
Ligand
BDBM337659
Substrate
Meas. Tech.
Enzymatic Assay
IC50
625±n/a nM
Citation
 Fürstner, CAckerstaff, JStraub, AMeier, HTinel, HZimmermann, KTersteegen, AZubov, DKast, RSchamberger, JSchäfer, M Substituted uracils and use thereof US Patent  US9751843 Publication Date 9/5/2017 
Target
Name:
Chymase
Synonyms:
Alpha-chymase CMA1_HUMAN CYM Mast cell protease I
Type:
Enzyme
Mol. Mass.:
27340.12
Organism:
Homo sapiens (Human)
Description:
Residue:
247
  
Inhibitor
Name:
BDBM337659
Synonyms:
Ethyl 3-(2,3-dichlorobenzyl)-1-[3,5-difluoro-4-(2-oxoimidazolidin-1-yl)phenyl]-2,4-dioxo-1,2,3,4-tetrahydropyrimidine-5-carboxylate | US9751843, 24
Type:
Small organic molecule
Emp. Form.:
C23H18Cl2F2N4O5
Mol. Mass.:
539.316
SMILES:
CCOC(=O)c1cn(-c2cc(F)c(N3CCNC3=O)c(F)c2)c(=O)n(Cc2cccc(Cl)c2Cl)c1=O
: