Target
Chymase
Ligand
BDBM337751
Substrate
Meas. Tech.
Enzymatic Assay
IC50
1900±n/a nM
Citation
 Fürstner, CAckerstaff, JStraub, AMeier, HTinel, HZimmermann, KTersteegen, AZubov, DKast, RSchamberger, JSchäfer, M Substituted uracils and use thereof US Patent  US9751843 Publication Date 9/5/2017 
Target
Name:
Chymase
Synonyms:
Alpha-chymase CMA1_HUMAN CYM Mast cell protease I
Type:
Enzyme
Mol. Mass.:
27340.12
Organism:
Homo sapiens (Human)
Description:
Residue:
247
  
Inhibitor
Name:
BDBM337751
Synonyms:
Ethyl 1-[4-(4,4-dimethyl-2-oxoimidazolidin-1-yl)phenyl]-3-[3-fluoro-2-(trifluoromethyl)benzyl]-2,4-dioxo-1,2,3,4-tetrahydropyrimidine-5-carboxylate | US9751843, 133
Type:
Small organic molecule
Emp. Form.:
C26H24F4N4O5
Mol. Mass.:
548.4862
SMILES:
CCOC(=O)c1cn(-c2ccc(cc2)N2CC(C)(C)NC2=O)c(=O)n(Cc2cccc(F)c2C(F)(F)F)c1=O
: