Target
Nuclear receptor ROR-gamma
Ligand
BDBM338426
Substrate
Meas. Tech.
Binding Assay
IC50
171±n/a nM
Citation
 Fauber, BGobbi, ARene, Ovan Niel, MBGancia, EGaines, SLadduwahetty, TVesey, DWard, SWinship, P Aryl sultam derivatives as RORc modulators US Patent  US9751873 Publication Date 9/5/2017 
Target
Name:
Nuclear receptor ROR-gamma
Synonyms:
NR1F3 Nuclear receptor ROR-gamma (RORC) RAR-related orphan receptor C (RORc) RORG RZRG Retinoid-related orphan receptor-gamma (RORc)
Type:
Enzyme Catalytic Domain
Mol. Mass.:
58218.40
Organism:
Homo sapiens (Human)
Description:
P51449
Residue:
518
  
Inhibitor
Name:
BDBM338426
Synonyms:
2-[2,5-difluoro-4-[[(3S,6R)-3- methyl-1,1-dioxo-6-phenyl- thiazinan-2- yl]methyl]phenyl]ethanol | US9751873, Example 113
Type:
Small organic molecule
Emp. Form.:
C20H23F2NO3S
Mol. Mass.:
395.463
SMILES:
C[C@H]1CC[C@H](c2ccccc2)S(=O)(=O)N1Cc1cc(F)c(CCO)cc1F
: