Target
Nuclear receptor ROR-gamma
Ligand
BDBM338468
Substrate
Meas. Tech.
Binding Assay
IC50
47.0±n/a nM
Citation
 Fauber, BGobbi, ARene, Ovan Niel, MBGancia, EGaines, SLadduwahetty, TVesey, DWard, SWinship, P Aryl sultam derivatives as RORc modulators US Patent  US9751873 Publication Date 9/5/2017 
Target
Name:
Nuclear receptor ROR-gamma
Synonyms:
NR1F3 Nuclear receptor ROR-gamma (RORC) RAR-related orphan receptor C (RORc) RORG RZRG Retinoid-related orphan receptor-gamma (RORc)
Type:
Enzyme Catalytic Domain
Mol. Mass.:
58218.40
Organism:
Homo sapiens (Human)
Description:
P51449
Residue:
518
  
Inhibitor
Name:
BDBM338468
Synonyms:
(7S)-2-[[2-fluoro-4-[(1R,5S)-6- (1,2,4-triazol-4-yl)-3- azabicyclo[3.1.0]hexan-3- yl]phenyl]methyl]-7-phenyl- thiazepane 1,1-dioxide | US9751873, Example 155
Type:
Small organic molecule
Emp. Form.:
C25H28FN5O2S
Mol. Mass.:
481.586
SMILES:
Fc1cc(ccc1CN1CCCC[C@@H](c2ccccc2)S1(=O)=O)N1C[C@H]2[C@@H](C1)[C@@H]2n1cnnc1
: