Target
Nuclear receptor ROR-gamma
Ligand
BDBM338474
Substrate
Meas. Tech.
Binding Assay
IC50
3020±n/a nM
Citation
 Fauber, BGobbi, ARene, Ovan Niel, MBGancia, EGaines, SLadduwahetty, TVesey, DWard, SWinship, P Aryl sultam derivatives as RORc modulators US Patent  US9751873 Publication Date 9/5/2017 
Target
Name:
Nuclear receptor ROR-gamma
Synonyms:
NR1F3 Nuclear receptor ROR-gamma (RORC) RAR-related orphan receptor C (RORc) RORG RZRG Retinoid-related orphan receptor-gamma (RORc)
Type:
Enzyme Catalytic Domain
Mol. Mass.:
58218.40
Organism:
Homo sapiens (Human)
Description:
P51449
Residue:
518
  
Inhibitor
Name:
BDBM338474
Synonyms:
4-[4-[3-fluoro-4-[[(3S,6S)-3-methyl- 1,1-dioxo-6-phenyl-thiazinan-2- yl]methyl]phenyl]piperazin-1- yl]benzoic acid | US9751873, Example 161
Type:
Small organic molecule
Emp. Form.:
C29H32FN3O4S
Mol. Mass.:
537.645
SMILES:
C[C@H]1CC[C@@H](c2ccccc2)S(=O)(=O)N1Cc1ccc(cc1F)N1CCN(CC1)c1ccc(cc1)C(O)=O
: