Target
ATP-sensitive inward rectifier potassium channel 1
Ligand
BDBM50235211
Substrate
Meas. Tech.
Thallium Flux Assay
IC50
75.7±n/a nM
Citation
 Tang, HPio, BJiang, JPasternak, ADong, SFerguson, II, RDGuo, ZZChobanian, HFrie, JGuo, YWu, ZYu, YWang, M Inhibitors of the renal outer medullary potassium channel US Patent  US9751881 Publication Date 9/5/2017 
Target
Name:
ATP-sensitive inward rectifier potassium channel 1
Synonyms:
ATP-regulated potassium channel ROM-K ATP-sensitive inward rectifier potassium channel 1 KCNJ1 Potassium channel (ATP modulatory) ROMK1 The Renal Outer Medullary Potassium (ROMK)
Type:
Enzyme Catalytic Domain
Mol. Mass.:
44809.08
Organism:
Homo sapiens (Human)
Description:
gi_223460826
Residue:
391
  
Inhibitor
Name:
BDBM50235211
Synonyms:
CHEMBL4093830
Type:
Small organic molecule
Emp. Form.:
C26H33N3O5S
Mol. Mass.:
499.622
SMILES:
Cc1nc(ccc1S(C)(=O)=O)N1CCC2(C1)CCN(C[C@H](O)c1ccc3C(=O)OCc3c1C)CC2
: