Target
ATP-sensitive inward rectifier potassium channel 1
Ligand
BDBM338513
Substrate
Meas. Tech.
Thallium Flux Assay
IC50
369±n/a nM
Citation
 Tang, HPio, BJiang, JPasternak, ADong, SFerguson, II, RDGuo, ZZChobanian, HFrie, JGuo, YWu, ZYu, YWang, M Inhibitors of the renal outer medullary potassium channel US Patent  US9751881 Publication Date 9/5/2017 
Target
Name:
ATP-sensitive inward rectifier potassium channel 1
Synonyms:
ATP-regulated potassium channel ROM-K ATP-sensitive inward rectifier potassium channel 1 KCNJ1 Potassium channel (ATP modulatory) ROMK1 The Renal Outer Medullary Potassium (ROMK)
Type:
Enzyme Catalytic Domain
Mol. Mass.:
44809.08
Organism:
Homo sapiens (Human)
Description:
gi_223460826
Residue:
391
  
Inhibitor
Name:
BDBM338513
Synonyms:
US9751881, Example 44
Type:
Small organic molecule
Emp. Form.:
C24H24N4O4
Mol. Mass.:
432.4718
SMILES:
Cc1c2COC(=O)c2ccc1[C@@H](O)CN1CCC2(CN(C2=O)c2ccc(cn2)C#N)CC1
: