Target
Lysine-specific histone demethylase 1A
Ligand
BDBM338669
Substrate
Meas. Tech.
LSD1 Inhibition Assay
IC50
<100.0±n/a nM
Citation
 Tomita, NTomita, DTominari, YImamura, SMorimoto, SKojima, TToyofuku, MHattori, YKaku, TIto, M Cyclopropanamine compound and use thereof US Patent  US9751885 Publication Date 9/5/2017 
Target
Name:
Lysine-specific histone demethylase 1A
Synonyms:
AOF2 Flavin-containing amine oxidase domain-containing protein 2 KDM1A KIAA0601 Lysine-specific demethylase 1 (LSD1) Lysine-specific histone demethylase 1 (LSD1)
Type:
Enzyme
Mol. Mass.:
92901.01
Organism:
Homo sapiens (Human)
Description:
O60341
Residue:
852
  
Inhibitor
Name:
BDBM338669
Synonyms:
3-(trans-2- ((cyclopropylmethyl)- amino)cyclopropyl)-N-(5- methyl-1,2-oxazol-3- yl)benzamide hydrochloride US9751885, 104 | US9751885, 105
Type:
Small organic molecule
Emp. Form.:
C18H21N3O2
Mol. Mass.:
311.3782
SMILES:
Cc1cc(NC(=O)c2cccc(c2)C2CC2NCC2CC2)no1
: