Target
Tyrosine-protein kinase JAK2
Ligand
BDBM260459
Substrate
Meas. Tech.
In vitro kinase assay
pH
7.3±n/a
Temperature
298.15±n/a K
IC50
3.00±n/a nM
Comments
extracted
Citation
 Zhang, XDong, QLiu, BZhu, YLi, XLan, J Pyrrole six-membered heteroaryl ring derivative, preparation method thereof, and medicinal uses thereof US Patent  US9527851 Publication Date 12/27/2016 
Target
Name:
Tyrosine-protein kinase JAK2
Synonyms:
JAK-2 JAK2_HUMAN Janus kinase 2 (JAK2) | Janus kinase 2 (a protein tyrosine kinase)
Type:
Protein
Mol. Mass.:
130684.68
Organism:
Homo sapiens (Human)
Description:
O60674
Residue:
1132
  
Inhibitor
Name:
BDBM260459
Synonyms:
US10428074, Example 17 US9527851, example 17
Type:
Small organic molecule
Emp. Form.:
C17H23N5O2
Mol. Mass.:
329.3968
SMILES:
C[C@H](O)C(=O)N1C[C@@H]2C[C@H](C[C@@H]2C1)N(C)c1ncnc2[nH]ccc12
: