Target
Tyrosine-protein kinase JAK2
Ligand
BDBM202489
Substrate
Meas. Tech.
In vitro kinase assay
pH
7.3±n/a
Temperature
298.15±n/a K
IC50
5.00±n/a nM
Comments
extracted
Citation
 Zhang, XDong, QLiu, BZhu, YLi, XLan, J Pyrrole six-membered heteroaryl ring derivative, preparation method thereof, and medicinal uses thereof US Patent  US9527851 Publication Date 12/27/2016 
Target
Name:
Tyrosine-protein kinase JAK2
Synonyms:
JAK-2 JAK2_HUMAN Janus kinase 2 (JAK2) | Janus kinase 2 (a protein tyrosine kinase)
Type:
Protein
Mol. Mass.:
130684.68
Organism:
Homo sapiens (Human)
Description:
O60674
Residue:
1132
  
Inhibitor
Name:
BDBM202489
Synonyms:
US9527851, example 99
Type:
Small organic molecule
Emp. Form.:
C21H27N7O4S
Mol. Mass.:
473.549
SMILES:
CN([C@@H]1C[C@H]2CN(C[C@H]2C1)C(=O)Oc1nc(OCC(C)(C)O)ns1)c1ncnc2[nH]ccc12
: