Target
Dimer of Gag-Pol polyprotein [482-580,I502K,I528M,T553A,V564F]
Ligand
BDBM517
Substrate
HIV Protease Chromogenic Peptide Substrate
Meas. Tech.
Protease Inhibition Assay
Ki
108±n/a nM
Citation
 Clemente, JCComan, RMThiaville, MMJanka, LKJeung, JANukoolkarn, SGovindasamy, LAgbandje-McKenna, MMcKenna, RLeelamanit, WGoodenow, MMDunn, BM Analysis of HIV-1 CRF_01 A/E protease inhibitor resistance: structural determinants for maintaining sensitivity and developing resistance to atazanavir. Biochemistry 45:5468-77 (2006)  
Target
Name:
Dimer of Gag-Pol polyprotein [482-580,I502K,I528M,T553A,V564F]
Synonyms:
HIV-1 Protease AE Mutant (V82F) Pretherapy isolated AE protease mutant (V82F)
Type:
Protein Complex
Mol. Mass.:
Description:
HIV-1 protease DNA for all the HIV B and AE variants was cloned, and protein was expressed and purified from Escherichia coli strain BL21.
Components:
This complex has 2 components.
Component 1
Name:
Gag-Pol polyprotein [482-580,I502K,I528M,T553A,V564F]
Synonyms:
HIV-1 Protease AE Mutant (V82F) Chain A POL_HV1U4 | gag-pol
Type:
Enzyme Subunit
Mol. Mass.:
10805.72
Organism:
Human immunodeficiency virus type 1
Description:
P24740[482-580,I502K,I528M,T553A,V564F]
Residue:
99
  
Component 2
Name:
Gag-Pol polyprotein [482-580,I502K,I528M,T553A,V564F]
Synonyms:
HIV-1 Protease AE Mutant (V82F) Chain A POL_HV1U4 | gag-pol
Type:
Enzyme Subunit
Mol. Mass.:
10805.72
Organism:
Human immunodeficiency virus type 1
Description:
P24740[482-580,I502K,I528M,T553A,V564F]
Residue:
99
  
Inhibitor
Name:
BDBM517
Synonyms:
(2S)-1-[(2S,4R)-4-benzyl-2-hydroxy-4-{[(1S,2R)-2-hydroxy-2,3-dihydro-1H-inden-1-yl]carbamoyl}butyl]-N-tert-butyl-4-(pyridin-3-ylmethyl)piperazine-2-carboxamide Crixivan Indinavir L-735, 524 | MK639
Type:
Small organic molecule
Emp. Form.:
C36H47N5O4
Mol. Mass.:
613.7895
SMILES:
CC(C)(C)NC(=O)[C@@H]1CN(Cc2cccnc2)CCN1C[C@@H](O)C[C@@H](Cc1ccccc1)C(=O)N[C@@H]1[C@H](O)Cc2ccccc12
:
Substrate
Name:
HIV Protease Chromogenic Peptide Substrate
Synonyms:
Type:
Peptide
Mol. Mass.:
1420.11
Organism:
Description:
Residue:
13
KARVLNPHEANLG