Target
Dimer of Gag-Pol polyprotein [490-588,L523I,E525D,M526I,I544V,L553H,H559K,L579M]
Ligand
BDBM520
Substrate
HIV Protease Chromogenic Peptide Substrate
Meas. Tech.
Protease Inhibition Assay
Ki
1.2±n/a nM
Citation
 Clemente, JCComan, RMThiaville, MMJanka, LKJeung, JANukoolkarn, SGovindasamy, LAgbandje-McKenna, MMcKenna, RLeelamanit, WGoodenow, MMDunn, BM Analysis of HIV-1 CRF_01 A/E protease inhibitor resistance: structural determinants for maintaining sensitivity and developing resistance to atazanavir. Biochemistry 45:5468-77 (2006)  
Target
Name:
Dimer of Gag-Pol polyprotein [490-588,L523I,E525D,M526I,I544V,L553H,H559K,L579M]
Synonyms:
HIV-1 Protease AE-P Mutant (F82V) Post-therapy HIV-1 CRF_01 A/E protease F82V back mutant
Type:
Protein Complex
Mol. Mass.:
Description:
HIV-1 protease DNA for all the HIV B and AE variants was cloned, and protein was expressed and purified from Escherichia coli strain BL21.
Components:
This complex has 2 components.
Component 1
Name:
Gag-Pol polyprotein [490-588,L523I,E525D,M526I,I544V,L553H,H559K,L579M]
Synonyms:
HIV-1 Protease AE-P Mutant (F82V) Chain A POL_HV1RH | gag-pol
Type:
Enzyme Subunit
Mol. Mass.:
10768.14
Organism:
Human immunodeficiency virus type 1
Description:
P05959[490-588,L523I,E525D,M526I,I544V,L553H,H559K,L579M]
Residue:
99
  
Component 2
Name:
Gag-Pol polyprotein [490-588,L523I,E525D,M526I,I544V,L553H,H559K,L579M]
Synonyms:
HIV-1 Protease AE-P Mutant (F82V) Chain A POL_HV1RH | gag-pol
Type:
Enzyme Subunit
Mol. Mass.:
10768.14
Organism:
Human immunodeficiency virus type 1
Description:
P05959[490-588,L523I,E525D,M526I,I544V,L553H,H559K,L579M]
Residue:
99
  
Inhibitor
Name:
BDBM520
Synonyms:
1,3-thiazol-5-ylmethyl N-[(2S,3S,5S)-3-hydroxy-5-[(2S)-3-methyl-2-{[methyl({[2-(propan-2-yl)-1,3-thiazol-4-yl]methyl})carbamoyl]amino}butanamido]-1,6-diphenylhexan-2-yl]carbamate CHEMBL163 RTV | Ritonavir
Type:
Small organic molecule
Emp. Form.:
C37H48N6O5S2
Mol. Mass.:
720.944
SMILES:
CC(C)[C@H](NC(=O)N(C)Cc1csc(n1)C(C)C)C(=O)N[C@H](C[C@H](O)[C@H](Cc1ccccc1)NC(=O)OCc1cncs1)Cc1ccccc1
:
Substrate
Name:
HIV Protease Chromogenic Peptide Substrate
Synonyms:
Type:
Peptide
Mol. Mass.:
1420.11
Organism:
Description:
Residue:
13
KARVLNPHEANLG