Target
Phosphatidylinositol 3-kinase regulatory subunit beta
Ligand
BDBM338878
Substrate
Meas. Tech.
Inhibition Assay
IC50
55±n/a nM
Citation
 Castro, ACEvans, CAJanardanannair, SLescarbeau, ALiu, TTremblay, MR Heterocyclic compounds and uses thereof US Patent  US9751888 Publication Date 9/5/2017 
Target
Name:
Phosphatidylinositol 3-kinase regulatory subunit beta
Synonyms:
P85B_HUMAN PI3-kinase subunit p85-beta PIK3R2 PtdIns-3-kinase regulatory subunit beta | PtdIns-3-kinase regulatory subunit p85-beta
Type:
Enzyme Subunit
Mol. Mass.:
81542.75
Organism:
Homo sapiens (Human)
Description:
O00459
Residue:
728
  
Inhibitor
Name:
BDBM338878
Synonyms:
US9751888, Compound 69
Type:
Small organic molecule
Emp. Form.:
C24H19ClN6O3
Mol. Mass.:
474.899
SMILES:
C[C@H](NC(=O)c1c(N)nn2cccnc12)c1cc2cccc(Cl)c2c(=O)n1-c1cccc(O)c1
: