Target
Histone deacetylase 1
Ligand
BDBM103543
Substrate
Meas. Tech.
In Vitro HDAC Assay
IC50
385±n/a nM
Citation
 Chen, DSong, HYSun, ETYu, NZou, Y Benzimidazole derivatives: preparation and pharmaceutical applications US Patent  US10201527 Publication Date 2/12/2019 
Target
Name:
Histone deacetylase 1
Synonyms:
Cereblon/Histone deacetylase 1 HDAC1 Histone deacetylase 1 (HDAC1) RPD3L1
Type:
Enzyme
Mol. Mass.:
55090.27
Organism:
Homo sapiens (Human)
Description:
Q13547
Residue:
482
  
Inhibitor
Name:
BDBM103543
Synonyms:
US10201527, Compound 13 US8551988, 13
Type:
Small organic molecule
Emp. Form.:
C18H18N4O3
Mol. Mass.:
338.3605
SMILES:
OCCCn1c(nc2cc(\C=C\C(=O)NO)ccc12)-c1ccccn1
: