Target
Histone deacetylase 1
Ligand
BDBM50248473
Substrate
Meas. Tech.
In Vitro HDAC Assay
IC50
195±n/a nM
Citation
 Chen, DSong, HYSun, ETYu, NZou, Y Benzimidazole derivatives: preparation and pharmaceutical applications US Patent  US10201527 Publication Date 2/12/2019 
Target
Name:
Histone deacetylase 1
Synonyms:
Cereblon/Histone deacetylase 1 HDAC1 Histone deacetylase 1 (HDAC1) RPD3L1
Type:
Enzyme
Mol. Mass.:
55090.27
Organism:
Homo sapiens (Human)
Description:
Q13547
Residue:
482
  
Inhibitor
Name:
BDBM50248473
Synonyms:
CHEMBL523646 US10201527, Compound 30 US8551988, 30
Type:
Small organic molecule
Emp. Form.:
C25H28N4O3
Mol. Mass.:
432.5148
SMILES:
ONC(=O)\C=C\c1ccc2n(CCCN3CCCC3=O)c(CCc3ccccc3)nc2c1
: