Target
Histone deacetylase 1
Ligand
BDBM50248377
Substrate
Meas. Tech.
In Vitro HDAC Assay
IC50
2210±n/a nM
Citation
 Chen, DSong, HYSun, ETYu, NZou, Y Benzimidazole derivatives: preparation and pharmaceutical applications US Patent  US10201527 Publication Date 2/12/2019 
Target
Name:
Histone deacetylase 1
Synonyms:
Cereblon/Histone deacetylase 1 HDAC1 Histone deacetylase 1 (HDAC1) RPD3L1
Type:
Enzyme
Mol. Mass.:
55090.27
Organism:
Homo sapiens (Human)
Description:
Q13547
Residue:
482
  
Inhibitor
Name:
BDBM50248377
Synonyms:
3-(5-(3-(hydroxyamino)-3-oxoprop-1-enyl)-2-phenethyl-1H-benzo[d]imidazol-1-yl)propanoic acid US10201527, Compound 32 US8551988, 32
Type:
Small organic molecule
Emp. Form.:
C21H21N3O4
Mol. Mass.:
379.4091
SMILES:
ONC(=O)\C=C\c1ccc2n(CCC(O)=O)c(CCc3ccccc3)nc2c1
: