Target
Histone deacetylase 1
Ligand
BDBM338947
Substrate
Meas. Tech.
In Vitro HDAC Assay
IC50
479±n/a nM
Citation
 Chen, DSong, HYSun, ETYu, NZou, Y Benzimidazole derivatives: preparation and pharmaceutical applications US Patent  US10201527 Publication Date 2/12/2019 
Target
Name:
Histone deacetylase 1
Synonyms:
Cereblon/Histone deacetylase 1 HDAC1 Histone deacetylase 1 (HDAC1) RPD3L1
Type:
Enzyme
Mol. Mass.:
55090.27
Organism:
Homo sapiens (Human)
Description:
Q13547
Residue:
482
  
Inhibitor
Name:
BDBM338947
Synonyms:
US10201527, Compound 42 | US10736881, Compound 42
Type:
Small organic molecule
Emp. Form.:
C17H16N4O2
Mol. Mass.:
308.3345
SMILES:
ONC(=O)\C=C\c1ccc2n(CCc3ccccn3)cnc2c1
: