Target
Histone deacetylase 1
Ligand
BDBM50247926
Substrate
Meas. Tech.
In Vitro HDAC Assay
IC50
1140±n/a nM
Citation
 Chen, DSong, HYSun, ETYu, NZou, Y Benzimidazole derivatives: preparation and pharmaceutical applications US Patent  US10201527 Publication Date 2/12/2019 
Target
Name:
Histone deacetylase 1
Synonyms:
Cereblon/Histone deacetylase 1 HDAC1 Histone deacetylase 1 (HDAC1) RPD3L1
Type:
Enzyme
Mol. Mass.:
55090.27
Organism:
Homo sapiens (Human)
Description:
Q13547
Residue:
482
  
Inhibitor
Name:
BDBM50247926
Synonyms:
3-(1-benzyl-2-phenethyl-1H-benzo[d]imidazol-6-yl)-N-hydroxyacrylamide US10201527, Compound 58 | US10736881, Compound 58
Type:
Small organic molecule
Emp. Form.:
C25H23N3O2
Mol. Mass.:
397.469
SMILES:
ONC(=O)\C=C\c1ccc2nc(CCc3ccccc3)n(Cc3ccccc3)c2c1
: