Target
Histone deacetylase 1
Ligand
BDBM1576
Substrate
Meas. Tech.
In Vitro HDAC Assay
IC50
1030±n/a nM
Citation
 Chen, DSong, HYSun, ETYu, NZou, Y Benzimidazole derivatives: preparation and pharmaceutical applications US Patent  US10201527 Publication Date 2/12/2019 
Target
Name:
Histone deacetylase 1
Synonyms:
Cereblon/Histone deacetylase 1 HDAC1 Histone deacetylase 1 (HDAC1) RPD3L1
Type:
Enzyme
Mol. Mass.:
55090.27
Organism:
Homo sapiens (Human)
Description:
Q13547
Residue:
482
  
Inhibitor
Name:
BDBM1576
Synonyms:
US10201527, Compound 76 US8551988, 76
Type:
Emp. Form.:
C30H32N4O2
Mol. Mass.:
480.6007
SMILES:
ONC(=O)\C=C\c1ccc2n(C3CCN(Cc4ccccc4)CC3)c(CCc3ccccc3)nc2c1
: