Target
Histone deacetylase 1
Ligand
BDBM103586
Substrate
Meas. Tech.
In Vitro HDAC Assay
IC50
1260±n/a nM
Citation
 Chen, DSong, HYSun, ETYu, NZou, Y Benzimidazole derivatives: preparation and pharmaceutical applications US Patent  US10201527 Publication Date 2/12/2019 
Target
Name:
Histone deacetylase 1
Synonyms:
Cereblon/Histone deacetylase 1 HDAC1 Histone deacetylase 1 (HDAC1) RPD3L1
Type:
Enzyme
Mol. Mass.:
55090.27
Organism:
Homo sapiens (Human)
Description:
Q13547
Residue:
482
  
Inhibitor
Name:
BDBM103586
Synonyms:
US10201527, Compound 79 US8551988, 79
Type:
Small organic molecule
Emp. Form.:
C21H21N3O2
Mol. Mass.:
347.4103
SMILES:
ONC(=O)\C=C\c1ccc2n(CC=C)c(CCc3ccccc3)nc2c1
: