Target
Retinaldehyde-binding protein 1
Ligand
BDBM338938
Substrate
Meas. Tech.
Isomerase Assay
IC50
<1000±n/a nM
Citation
 Scott, ILKuksa, VAGall, AOrme, MWGage, JLittle, Jr., TLJiang, QRossiter, LMMcGee, Jr., KFKubota, R Styrenyl derivative compounds for treating ophthalmic diseases and disorders US Patent  US10201545 Publication Date 2/12/2019 
Target
Name:
Retinaldehyde-binding protein 1
Synonyms:
CRALBP RLBP1 | RLBP1_HUMAN
Type:
Enzyme Catalytic Domain
Mol. Mass.:
36462.25
Organism:
Homo sapiens (Human)
Description:
P12271
Residue:
317
  
Inhibitor
Name:
BDBM338938
Synonyms:
(R,E)-1-amino-3-(3-(2,6-dichlorostyryl)phenyl)propan- 2-ol | US10201545, Compound 74
Type:
Small organic molecule
Emp. Form.:
C17H17Cl2NO
Mol. Mass.:
322.229
SMILES:
NC[C@H](O)Cc1cccc(\C=C\c2c(Cl)cccc2Cl)c1
: